ガンマナイフ・定位多軌道照射実施件数
type: TerminologyConcept
description: 半球状に配置された多数の放射線源から、ガンマ線を集中的に脳腫瘍等に照射する治療法（ガンマナイフ）、または、リニアックの回転機構を用いて、多くの軌道を描かせて多方向からＸ線を集中的に脳腫瘍等に照射する治療法（定位多軌道照射）の実施件数。
created: 2017-12-01
broader: Ta00402
top concept of: TerminologyConceptScheme
in scheme: TerminologyConceptScheme

RDF description of ガンマナイフ・定位多軌道照射実施件数
primary topic: ガンマナイフ・定位多軌道照射実施件数