オペレーターとしての従事の有無
type: TerminologyConcept
description: 農業生産組織にオペレーターとして従事したかどうかの別。同組織に参加している個人所有の機械を利用し、同組織の農作業を行った場合も含める。
created: 2017-12-01
broader: Ta00531
top concept of: TerminologyConceptScheme
in scheme: TerminologyConceptScheme

RDF description of オペレーターとしての従事の有無
primary topic: オペレーターとしての従事の有無