RI検査装置数
type: TerminologyConcept
description: RI検査装置の数。患者の体内に投与されたＲＩ（ラジオアイソトープ）の分布を測定する検査（血流動態シンチグラム、シングルホトンエミッションコンピューター断層撮影を含む）の装置台数。【平成20年10月1日追記】
created: 2017-12-01
broader: Ta00420
top concept of: TerminologyConceptScheme
in scheme: TerminologyConceptScheme

RDF description of RI検査装置数
primary topic: RI検査装置数