75条の学級担当教員数A
type: TerminologyConcept
description: 学校に勤務している教員（休職者等を含む。）のうち、学校教育法に定める特別支援学級を担当し、特別支援教育に直接従事することを本務とする学級専任の教員数。【平成25年5月 「特別支援学級担当教員数」に定義内容を変更】
created: 2017-12-01
broader: Ta00122
top concept of: TerminologyConceptScheme
in scheme: TerminologyConceptScheme

RDF description of 75条の学級担当教員数A
primary topic: 75条の学級担当教員数A