RDF description of 75条の学級の学級区分A
primary topic: 75条の学級の学級区分A

75条の学級の学級区分A
type: TerminologyConcept
in scheme: TerminologyConceptScheme
top concept of: TerminologyConceptScheme
broader: Ta00516
created: 2017-12-01
description: 75条の学級の編制方法の区分。「知的障害」、「肢体不自由」、「病弱・身体虚弱」、「弱視」、「難聴」、「言語障害」及び「情緒障害」の７種類の区分がある。【平成25年5月 「特別支援学級の学級区分」に定義内容を変更】