RDF description of 沈下もみ数
primary topic: 沈下もみ数

沈下もみ数
type: TerminologyConcept
description: 比重選により沈んだもみ数。比重選の方法は、バケツ等の容器に水を入れ、これに抽出した試料を入れ、よく攪拌する。その後、２分間位置き、もみの沈下及び浮上の状況を確認し、浮上もみをすくい上げる。次に沈下もみをすくい上げる。すくい上げたそれぞれのもみを新聞紙等に分けて広げ水を切る。
created: 2017-12-01
broader: Ta00377
in scheme: TerminologyConceptScheme
top concept of: TerminologyConceptScheme